*HEADING
: uniaxial tension, coupled-temp displ, displ control, 2d, cax4t
*NODE
*ELEMENT,TYPE=CAX4t,ELSET=METAL
*SOLID SECTION,ELSET=METAL,MATERIAL=EL
*MATERIAL,NAME=EL
*ELASTIC
200.E9,.3
*PLASTIC
7.E8,0.00
3.7E9,10.0
*porous metal plasticity,relative=0.95
**q1 , q2, q3
*SPECIFIC HEAT
586.,
*DENSITY
7833.,
*CONDUCTIVITY
52.,
*EXPANSION
1.2E-5,
*INELASTIC HEAT FRACTION
*BOUNDARY
1, 1,2
2, 2,2
4, 1,1
*STEP,INC=100,AMP=RAMP,NLGEOM
*COUPLED TEMPERATURE-DISPLACEMENT,DELTMX=100.
1.,100.,,1.
*BOUNDARY
3, 2,2, .01
4, 2,2, .01
*EL PRINT, ELSET=METAL,FREQUENCY=10
S,MISES
E,
PE,
VVF,TEMP
*NODE PRINT, FREQUENCY=10
U,RF,NT,RFL
*OUTPUT,FIELD,FREQ=10
*ELEMENT OUTPUT
S,
E,
PE,
VVF,TEMP
*OUTPUT,FIELD,FREQ=10
*NODE OUTPUT
U,
RF,
NT,
RFL,
*END STEP