*HEADING
 FILE NAME:
 FEATURES TESTED: THREE DIMENSIONAL INTERFACE
                  GAP CONDUCTIVITY
                  CLEARANCE DEPENDENT
*NODE,NSET=PLANEA
*NCOPY,CHANGE NUMBER=10,OLD SET=PLANEA,SHIFT,NEW SET=PLANEB
*NCOPY,CHANGE NUMBER=20,OLD SET=PLANEA,SHIFT,NEW SET=PLANEC
*NCOPY,CHANGE NUMBER=30,OLD SET=PLANEA,SHIFT,NEW SET=PLANED
*NSET,NSET=ALL
PLANEA,PLANEB,PLANEC,PLANED
*NSET,NSET=CDPLANE
PLANEC,PLANED
*NSET,NSET=BCPLANE
PLANEB,PLANEC
*ELEMENT,TYPE=C3D8T,ELSET=ONE
*ELEMENT,TYPE=C3D8T,ELSET=TWO
*ELSET,ELSET=EALL
ONE,TWO
*SOLID SECTION,ELSET=EALL,MATERIAL=BLOCK
*MATERIAL,NAME=BLOCK
*ELASTIC,TYPE=ISO
1.E5,
*EXPANSION,TYPE=ISO,ZERO=0.0
1.E-5,
*CONDUCTIVITY,TYPE=ISO
1.,
*surface,NAME=ASURF
ONE,S1
*surface,NAME=BSURF
TWO,S2
*CONTACT PAIR,INTERACTION=GAPC,SMALL SLIDING
ASURF,BSURF
*SURFACE INTERACTION,NAME=GAPC
** clearance dependent gap conductance present
*GAP CONDUCTANCE
*BOUNDARY
ALL,2,3
PLANEA,1
PLANEC,1
*STEP
*COUPLED TEMPERATURE-DISPLACEMENT,STEADY STATE
 1., 1.
*BOUNDARY
PLANEA,11,11,400.
CDPLANE,11,11,200.
*OUTPUT,FIELD
*NODE OUTPUT,NSET=PLANEB
U,
NT,
*OUTPUT,FIELD
*ELEMENT OUTPUT,ELSET=ONE
S,
TEMP,
*EL PRINT
S,
E,
TEMP,
*NODE PRINT
U,
RF,
NT11,
*PRINT,CONTACT=YES
*CONTACT PRINT,SUM=YES,TOT=NO,FREQ=1,SLA=ASURF,MAST=BSURF,NSET=BCPLANE
*OUTPUT,FIELD,FREQ=1
*CONTACT OUTPUT,VARIABLE=PRESELECT,SLAVE=ASURF,MASTER=BSURF,NSET=BCPLANE
*END STEP