*HEADING
 FILE NAME:
 FEATURES TESTED: TWO DIMENSIONAL INTERFACE
                  GAP CONDUCTIVITY
                  CLEARANCE DEPENDENT
*NODE, NSET=NALL
*NODE, NSET=XTRA
*NSET,NSET=PLANEA
*NSET,NSET=PLANEB
*NSET,NSET=PLANEC
*NSET,NSET=PLANED
*NSET,NSET=BCPLANE
 PLANEB,PLANEC
*NSET,NSET=CDPLANE
 PLANEC,PLANED
*ELEMENT,TYPE=CPEG4T,ELSET=ONE
*ELEMENT,TYPE=CPEG4T,ELSET=TWO
*ELSET,ELSET=EALL
 ONE,TWO
*SOLID SECTION,ELSET=EALL,MATERIAL=BLOCK,REFNODE=XTRA
*MATERIAL,NAME=BLOCK
*ELASTIC,TYPE=ISO
 1.E5,
*EXPANSION,TYPE=ISO,ZERO=0.0
 1.E-5,
*CONDUCTIVITY,TYPE=ISO
 1.,
*SURFACE,NAME=ASURF
 ONE,S2
*SURFACE,NAME=BSURF
 TWO,S4
*CONTACT PAIR,INTERACTION=GAPC,SMALL SLIDING
 ASURF,BSURF
*SURFACE INTERACTION,NAME=GAPC
** clearance dependent gap conductance present
*GAP CONDUCTANCE
*BOUNDARY
 NALL,2,2
 PLANEA,1
 PLANEC,1
*STEP
*COUPLED TEMPERATURE-DISPLACEMENT,STEADY STATE
 1., 1.
*BOUNDARY
 PLANEA,11,11,400.
 CDPLANE,11,11,200.
*NODE FILE,NSET=PLANEB
 U,
 NT,
*OUTPUT,FIELD
*NODE OUTPUT,NSET=PLANEB
 U,
 NT,
*EL FILE,ELSET=ONE
 S,
 TEMP,
*OUTPUT,FIELD
*ELEMENT OUTPUT,ELSET=ONE
 S,
 TEMP,
*EL PRINT
 S,
 E,
 TEMP,
*NODE PRINT
 U,
 RF,
 NT11,
*PRINT,CONTACT=YES
*CONTACT PRINT,SUM=YES,TOT=NO,FREQ=1,SLA=ASURF,MAST=BSURF,NSET=BCPLANE
*CONTACT FILE,SLAVE=ASURF,MASTER=BSURF,NSET=BCPLANE,FREQ=1
*OUTPUT,FIELD,FREQ=1
*CONTACT OUTPUT,VARIABLE=PRESELECT,SLAVE=ASURF,MASTER=BSURF,NSET=BCPLANE
*END STEP