*HEADING
DRUCKER-PRAGER/LINEAR ELASTICITY, CRITERION=HYP, UC TEST, 3D
WITH STATIC LINEAR PERTURBATIONS
*NODE,NSET=ALLN
*ELEMENT,TYPE=C3D8,ELSET=ALLE
*SOLID SECTION,ELSET=ALLE,MATERIAL=ALLE
*MATERIAL,NAME=ALLE
*ELASTIC
300.E3,.3
*DRUCKER PRAGER,SHEAR CRITERION=HYPERBOLIC
*DRUCKER PRAGER HARDENING
*STEP,INC=10
STEP 1 - NONLINEAR
*STATIC,DIRECT
1.,10.
*BOUNDARY
1,PINNED
2,2
5,2
6,2
4,1
5,1
8,1
2,3
3,3
*EL PRINT
S,
SINV,
E,
PE,
EE,
*NODE PRINT
U,
RF,
*OUTPUT,FIELD,FREQ=10
*ELEMENT OUTPUT
S,E,PE
*END STEP
*STEP,PERTURBATION,INC=1
STEP 2 - LINEAR PERTURBATION
*STATIC,DIRECT
.1,.1
*BOUNDARY
1,PINNED
2,2
5,2
6,2
4,1
5,1
8,1
2,3
3,3
*EL PRINT
S,
SINV,
E,
*NODE PRINT
U,
RF,
*OUTPUT,FIELD,FREQ=10
*ELEMENT OUTPUT
S,E
*END STEP
*STEP,INC=10
STEP 3 - REST OF NONLINEAR
*STATIC,DIRECT
1.,10.
*BOUNDARY
7,3,,-.2
5,3,,-.2
6,3,,-.2
8,3,,-.2
*END STEP
*STEP,PERTURBATION,INC=1
STEP 4 - LINEAR PERTURBATION
*STATIC,DIRECT
.1,.1
*BOUNDARY
1,PINNED
2,2
5,2
6,2
4,1
5,1
8,1
2,3
3,3
*EL PRINT
S,
SINV,
E,
*NODE PRINT
U,
RF,
*OUTPUT,FIELD,FREQ=10
*ELEMENT OUTPUT
S,E
*END STEP