*HEADING
DRUCKER-PRAGER/LINEAR ELASTICITY, CRITERION=HYP, TC TEST, CAX4R
*NODE,NSET=ALLN
*ELEMENT,TYPE=CAX4R,ELSET=ALLE
*SOLID SECTION,ELSET=ALLE,MATERIAL=ALLE
*MATERIAL,NAME=ALLE
*DENSITY
1.0E-2
*ELASTIC
300.E3,.3
*DRUCKER PRAGER,SHEAR CRITERION=HYPERBOLIC
*DRUCKER PRAGER HARDENING
*BOUNDARY
1,PINNED
2,2
4,1
*INITIAL CONDITIONS,TYPE=STRESS
ALLE,-5000.,-5000.,-5000.
*STEP, NLGEOM=NO
*DYNAMIC,EXPLICIT
 ,1.
*DLOAD
1,P2,5000.
1,P3,5000.
*BOUNDARY,TYPE=VELOCITY
3,2,,-.2
4,2,,-.2
*OUTPUT,FIELD
*ELEMENT OUTPUT
S,E,PE,PEEQ
*NODE OUTPUT
U,RF
*OUTPUT,HISTORY,VARIABLE=PRESELECT
*ELEMENT OUTPUT,ELSET=ALLE
PEEQ,MISES,PRESS
*END STEP