*HEADING
DRUCKER-PRAGER/LINEAR ELASTICITY, CRITERION=HYP, SHEAR TEST, 2D, CPS4R
*NODE,NSET=ALLN
*ELEMENT,TYPE=CPS4R,ELSET=ALLE
*SOLID SECTION,ELSET=ALLE,MATERIAL=ALLE
*MATERIAL,NAME=ALLE
*DENSITY
1.0E-2
*ELASTIC
300.E3,.3
*DRUCKER PRAGER,SHEAR CRITERION=HYPERBOLIC
*DRUCKER PRAGER HARDENING
*BOUNDARY
1,PINNED
2,PINNED
3,2
4,2
*STEP
*DYNAMIC,EXPLICIT
 ,1.
*BOUNDARY,TYPE=VELOCITY
3,1,,.5
4,1,,.5
*OUTPUT,FIELD
*ELEMENT OUTPUT
S,E,PE,PEEQ
*NODE OUTPUT
U,RF
*OUTPUT,HISTORY,VARIABLE=PRESELECT
*ELEMENT OUTPUT,ELSET=ALLE
PEEQ,MISES,PRESS
*END STEP