*HEADING
DRUCKER-PRAGER/LINEAR ELASTICITY, CRITERION=EXP W/ TEST DATA, TT, CPE4R
*NODE,NSET=ALLN
*ELEMENT,TYPE=CPE4R,ELSET=ALLE
*SOLID SECTION,ELSET=ALLE,MATERIAL=ALLE
*MATERIAL,NAME=ALLE
*DENSITY
1.0E-2
*ELASTIC
300.E3,.3
*DRUCKER PRAGER,SHEAR CRITERION=EXPONENT,TEST DATA
*TRIAXIAL TEST DATA,B=1.0
*DRUCKER PRAGER HARDENING
*BOUNDARY
1,PINNED
2,2
4,1
*STEP
*DYNAMIC,EXPLICIT
 ,1.
*BOUNDARY,TYPE=VELOCITY
3,2,,-.4
4,2,,-.4
2,1,,.1
3,1,,.5
*OUTPUT,FIELD
*ELEMENT OUTPUT
S,E,PE, PEEQ
*NODE OUTPUT
U, RF
*OUTPUT,HISTORY,VARIABLE=PRESELECT
*ELEMENT OUTPUT,ELSET=ALLE
PEEQ, MISES, PRESS
*END STEP