*HEADING
DRUCKER-PRAGER/LINEAR ELASTICITY, SHEAR CRITERION=EXP W/ TEST DATA, UT, 3D
*NODE,NSET=ALLN
*ELEMENT,TYPE=C3D8R,ELSET=ALLE
*SOLID SECTION,ELSET=ALLE,MATERIAL=ALLE
*MATERIAL,NAME=ALLE
*DENSITY
1.0E-2
*ELASTIC
300.E3,.3
*DRUCKER PRAGER,SHEAR CRITERION=EXPONENT,TEST DATA
*TRIAXIAL TEST DATA,B=1.0
*DRUCKER PRAGER HARDENING
*BOUNDARY
1,PINNED
2,2
5,2
6,2
4,1
5,1
8,1
2,3
3,3
*STEP
*DYNAMIC,EXPLICIT
 ,1.
*BOUNDARY,TYPE=VELOCITY
7,3,,.2
5,3,,.2
6,3,,.2
8,3,,.2
*OUTPUT,FIELD
*ELEMENT OUTPUT
S,E,PE,PEEQ
*NODE OUTPUT
U,RF
*OUTPUT,HISTORY,VARIABLE=PRESELECT
*ELEMENT OUTPUT,ELSET=ALLE
PEEQ,MISES,PRESS
*END STEP