*HEADING
DRUCKER-PRAGER/LINEAR ELASTICITY, CRITERION=EXP W/ TEST DATA,SHEAR TEST, 3D
*NODE,NSET=ALLN
*ELEMENT,TYPE=C3D8R,ELSET=ALLE
*SOLID SECTION,ELSET=ALLE,MATERIAL=ALLE
*MATERIAL,NAME=ALLE
*DENSITY
1.0E-2
*ELASTIC
300.E3,.3
*DRUCKER PRAGER,SHEAR CRITERION=EXPONENT,TEST DATA
*TRIAXIAL TEST DATA,B=1.0
*DRUCKER PRAGER HARDENING
*BOUNDARY
1,PINNED
2,PINNED
3,PINNED
4,PINNED
5,1
5,3
6,1
6,3
7,1
7,3
8,1
8,3
*STEP
*DYNAMIC,EXPLICIT
 ,1.
*BOUNDARY,TYPE=VELOCITY
7,2,,.5
5,2,,.5
6,2,,.5
8,2,,.5
*OUTPUT,FIELD
*ELEMENT OUTPUT
S,E,PE,PEEQ
*NODE OUTPUT
U,RF
*OUTPUT,HISTORY,VARIABLE=PRESELECT
*ELEMENT OUTPUT,ELSET=ALLE
PEEQ,MISES,PRESS
*END STEP