*Heading
*Preprint, echo=NO, model=NO, history=NO, contact=NO
**
** PARTS
**
*Part, name=UnitBlock
*End Part
**
**
** ASSEMBLY
**
*Assembly, name=Assembly
**
*Instance, name=UnitBlock-1, part=UnitBlock
*Node
*Element, type=DC3D10
*Nset, nset=All, generate
*Elset, elset=All, generate
*Nset, nset=Top
*Elset, elset=Top
*Nset, nset=Bottom
*Elset, elset=Bottom
*Elset, elset=_TopSurf_S3, internal
*Surface, type=ELEMENT, name=TopSurf
_TopSurf_S3, S3
*Elset, elset=_BotSurf_S3, internal
*Surface, type=ELEMENT, name=BotSurf
_BotSurf_S3, S3
** Section: BOTH
*Solid Section, elset=All, material=BLOCK
*End Instance
**
*Instance, name=UnitBlock-2, part=UnitBlock
*Node
*Element, type=DC3D10
*Nset, nset=All, generate
*Elset, elset=All, generate
*Nset, nset=Top
*Elset, elset=Top
*Nset, nset=Bottom
*Elset, elset=Bottom
*Elset, elset=_TopSurf_S4, internal
*Elset, elset=_TopSurf_S3, internal
*Surface, type=ELEMENT, name=TopSurf
_TopSurf_S4, S4
_TopSurf_S3, S3
*Elset, elset=_BotSurf_S2, internal
*Surface, type=ELEMENT, name=BotSurf
_BotSurf_S2, S2
** Section: BOTH
*Solid Section, elset=All, material=BLOCK
*End Instance
**
*End Assembly
**
** MATERIALS
**
*Material, name=BLOCK
*Conductivity
10.,
**
** INTERACTION PROPERTIES
**
*Surface Interaction, name=GAPC
1.,
*Gap Conductance
**
** INTERACTIONS
**
** Interaction: Int-1
*Contact Pair, interaction=GAPC, type=SURFACE TO SURFACE, adjust=0.1
UnitBlock-1.BotSurf, UnitBlock-2.TopSurf
** ----------------------------------------------------------------
**
** STEP: Step-1
**
*Step, name=Step-1, unsymm=YES
*Heat Transfer, steady state, deltmx=0.
0.25, 1., 1e-05, 0.25,
**
** BOUNDARY CONDITIONS
**
** Name: AppliedTemp1000 Type: Temperature
*Boundary
UnitBlock-1.Top, 11, 11, 1000.
** Name: ColdBlock Type: Temperature
*Boundary
UnitBlock-2.All, 11, 11
**
** OUTPUT REQUESTS
**
*Restart, write, frequency=0
**
** FIELD OUTPUT: F-Output-1
**
*Output, field
*Node Output
NT,
*Output, history, frequency=0
*End Step