*HEADING
 Mohr-Coulomb Tension cutoff
 CAX4R element, Triaxial Extension
*NODE,NSET=ALLN
*ELEMENT,TYPE=CAX4R,ELSET=ALLE
*SOLID SECTION,ELSET=ALLE,MATERIAL=ALLE
*MATERIAL,NAME=ALLE
*DENSITY
 1.0E-3
*ELASTIC
 300.E3,.3
*MOHR COULOMB
*MOHR COULOMB HARDENING
*tension cutoff
*BOUNDARY
 1,PINNED
 2,2
 4,1
*INITIAL CONDITIONS,TYPE=STRESS
 ALLE,-5000.,-5000.,-5000.
*STEP,NLGEOM=NO
*DYNAMIC,EXPLICIT
 ,1.E-3
*DLOAD
 1,P2,5000.
 1,P3,5000.
*output,field
*element output,elset=alle
peeqt
*node output
u
*output,history,variable=preselect
*element output,elset=alle
peeq,peeqt,pener
*END STEP
*STEP
*DYNAMIC,EXPLICIT
 ,1.
*BOUNDARY,TYPE=VELOCITY
 3,2,,.2
 4,2,,.2
*END STEP