*HEADING
CAST IRON PLASTICITY, INHOMOGENEOUS DEFORMATION, CPE4R
*NODE,NSET=ALLN
*ELEMENT,TYPE=CPE4R,ELSET=ONE
*SOLID SECTION,ELSET=ONE,MATERIAL=CASTIRON
*MATERIAL,NAME=CASTIRON
*DENSITY
1.0E3
*ELASTIC
14.773E6,0.2273
*CAST IRON PLASTICITY
*CAST IRON TENSION HARDENING
*CAST IRON COMPRESSION HARDENING
*BOUNDARY
1,PINNED
2,2
4,1
*STEP
*DYNAMIC,EXPLICIT
 ,100.
*AMPLITUDE,NAME=AMP-1
0.0,0.0,100.0,1.0
*BOUNDARY,AMPLITUDE=AMP-1
2,1,,.002
3,1,,.004
3,2,,.004
4,2,,.002
*OUTPUT,FIELD
*ELEMENT OUTPUT
S,LE,PE,
PEEQT,PEEQ
*NODE OUTPUT
U,RF
*OUTPUT,HISTORY
*ELEMENT OUTPUT, ELSET=ONE
PRESS,MISES,S,E,PE
PEEQT,PEEQ
*END STEP