*HEADING
CAST IRON PLASTICITY: UNIAXIAL TENSION, DISPL CONTROL, 2D, CAX4R
*NODE
*ELEMENT,TYPE=CAX4R,ELSET=ONE
*BOUNDARY
 1 , 2 , , 0.
 2 , 2 , , 0.
*NSET,NSET=TOP
*SOLID SECTION,MATERIAL=BLOCK,ELSET=ONE
*MATERIAL,NAME=BLOCK
*DENSITY
1.0
*ELASTIC
14.773E6,0.2273
*CAST IRON PLASTICITY
*CAST IRON TENSION HARDENING
*CAST IRON COMPRESSION HARDENING
*STEP
*DYNAMIC,EXPLICIT
 , 1.
*BOUNDARY, TYPE=VELOCITY
TOP , 2 , 2 , 0.005
*OUTPUT,FIELD
*ELEMENT OUTPUT
S,LE,PE
PEEQT,PEEQ
*NODE OUTPUT
U,RF
*OUTPUT,HISTORY
*ELEMENT OUTPUT, ELSET=ONE
PRESS,MISES,S,E,PE
PEEQT,PEEQ
*END STEP