*HEADING
CAST IRON PLASTICITY, SHEAR, C3D8
*NODE,NSET=ALL
*NSET,NSET=FACE1
*NSET,NSET=FACE2
*NSET,NSET=FACE3
*NSET,NSET=FACE4
*NSET,NSET=FACE42
*NSET,NSET=FACE5
*NSET,NSET=FACE6
*EQUATION
FACE42,1,1, 2,1,-1
*EQUATION
*EQUATION
*ELEMENT,TYPE=C3D8,ELSET=ONE
*SOLID SECTION,ELSET=ONE,MATERIAL=TREL
*MATERIAL,NAME=TREL
*DENSITY
1.0
*ELASTIC
14.773E6,0.2273
*CAST IRON PLASTICITY
*CAST IRON TENSION HARDENING
*CAST IRON COMPRESSION HARDENING
*STEP,INC=400
Step 1: Shear
*STATIC
.05,1.,,.05
*BOUNDARY,OP=NEW
FACE6,1,1
1,2,2,
5,2,2,
FACE2,3,3
2,2,2,0.0075
6,2,2,0.0075
*EL PRINT
S,
SINV,
E,
PE,
PEEQT,
*NODE PRINT
U,RF
*OUTPUT,FIELD,FREQ=10
*ELEMENT OUTPUT
S,E,PE
PEEQT,
*RESTART,WRITE
*END STEP