*HEADING
CAST IRON PLASTICITY, UNIAXIAL TENSION TEST, T3D2
WITH MULTIPLE LOAD CASES
*NODE,NSET=ALLN
*ELEMENT,TYPE=T3D2,ELSET=ALLE
*SOLID SECTION,ELSET=ALLE,MATERIAL=ALLE
0.1,
*MATERIAL,NAME=ALLE, RTOL=0.001
*density
1.0
*ELASTIC
14.773E6,0.2273
*CAST IRON PLASTICITY
*CAST IRON TENSION HARDENING
*CAST IRON COMPRESSION HARDENING
*BOUNDARY
1,1,3,
*STEP
*DYNAMIC,EXPLICIT
 ,20.
*amplitude,name=amp-1
0.0,0.0,20.0,1.0
*BOUNDARY,amplitude=amp-1
2,1,1,-.0025
*OUTPUT,FIELD,FREQ=10
*ELEMENT OUTPUT
PE,S,E,PEEQT
*output,history
*element output,elset=alle
PE11,S11,PEEQT,PEEQ
*END STEP