*HEADING
 SKEW-SENSITIVITY ANALYSIS, 0 DEG, SC8R, 1 X 8 MESH
*PREPRINT,ECHO=YES,HISTORY=NO,MODEL=NO
*NODE
*NGEN,NSET=FIX
*NGEN,NSET=END
*NSET, NSET=N1,GENERATE
*NFILL
FIX,END,8,2
*ELEMENT,TYPE=SC8R
*ELGEN,ELSET=EALL
*MATERIAL,NAME=A1
*ELASTIC
1.E8,0.
*SHELL SECTION,MATERIAL=A1,ELSET=EALL
.2,
*STEP,PERTURBATION
*STATIC
*BOUNDARY
FIX,1,3
N1, 3,3
*CLOAD
17,2,-.25
417,2,-.25
1017,2,-.25
1417,2,-.25
*EL PRINT
 SF,
 SE,
*NODE PRINT
 U,
*OUTPUT,FIELD
*NODE OUTPUT
 U,
 RF,
*ELEMENT OUTPUT
 SF,
 SE,
*END STEP