*HEADING
 CANTILEVER WITH CONTINUUM ELEMENTS--END SHEAR, CPS8R, 8 X 16 MESH
*NODE
*NGEN,NSET=FIX
*NGEN,NSET=END
*NFILL
FIX,END,32,1
*NSET,NSET=FIX,GENERATE
*ELEMENT,TYPE=CPS8R
*ELGEN,ELSET=EALL
*MATERIAL,NAME=A1
*ELASTIC
1.E8,0.
*SOLID SECTION,MATERIAL=A1,ELSET=EALL
.01,
*STEP,PERTURBATION
*STATIC
*BOUNDARY
FIX,1,2
*CLOAD
33,2,-.125
433,2,-.25
833,2,-.25
1233,2,-.25
1633,2,-.125
*EL PRINT
COORD,
S,
E,
*NODE FILE
U,
*OUTPUT,FIELD
*NODE OUTPUT
U,
*END STEP