*HEADING
 SKEW-SENSITIVITY ANALYSIS, 0 DEG, CPS8R, 1 X 8 MESH
*NODE
*NGEN,NSET=FIX
*NGEN,NSET=END
*NFILL
FIX,END,16,1
*NSET,NSET=FIX,GENERATE
*ELEMENT,TYPE=CPS8R
*ELGEN,ELSET=EALL
*MATERIAL,NAME=A1
*ELASTIC
1.E8,0.
*SOLID SECTION,MATERIAL=A1,ELSET=EALL
.01,
*STEP
*STATIC
*BOUNDARY
FIX,1,2
*CLOAD
17,2, -.1666666666666667
417,2,-.6666666666666667
817,2,-.1666666666666667
*EL PRINT
COORD,
S,
E,
*NODE FILE
U,
*OUTPUT,FIELD
*NODE OUTPUT
U,
*END STEP