*HEADING
 SKEW-SENSITIVITY ANALYSIS, 45 DEG TRAPEZOID, CPS6M,
*RESTART,WRITE
**
*NODE
**
**
*ELEMENT, TYPE=CPS6M, ELSET=EALL
*SOLID SECTION,ELSET=EALL,MATERIAL=A1,controls=ctr
.01,
*section controls,name=ctr,hourglass=stiffness
*MATERIAL,NAME=A1
*ELASTIC
1.E8,0.
**
** step  1,Default
**
*STEP, PERTURBATION
*STATIC
**
** fix
**
*BOUNDARY
       1, 1,,          0.
       1, 2,,          0.
       1, 3,,          0.
       2, 1,,          0.
       2, 2,,          0.
       2, 3,,          0.
       3, 1,,          0.
       3, 2,,          0.
**
** load
**
*CLOAD, OP=NEW
      64, 2,        -0.5
      66, 2,        -0.5
*EL PRINT
S,
E,
*NODE FILE
U,
*OUTPUT,FIELD
*NODE OUTPUT
U,
*END STEP