*HEADING
 CANTILEVER WITH CONTINUUM ELEMENTS--END SHEAR, CPS4R, 1 X 4 MESH
*NODE
*NGEN,NSET=FIX
*NGEN,NSET=END
*NFILL
FIX,END,4,4
*ELEMENT,TYPE=CPS4R
*ELGEN,ELSET=EALL
*MATERIAL,NAME=A1
*ELASTIC
1.E8,0.
*SOLID SECTION,MATERIAL=A1,ELSET=EALL,CONTROLS=HGC
.01,
*SECTION CONTROLS,NAME=HGC,HOURGLASS=ENHANCED
*STEP,PERTURBATION
*STATIC
*BOUNDARY
FIX,1,2
*CLOAD
17,2,-.5
417,2,-.5
*EL PRINT
COORD,
S,
E,
*OUTPUT,FIELD
*ELEMENT OUTPUT
S,
E,
*NODE OUTPUT
RF,
U,
*NSET,NSET=NOUT
*ELSET,ELSET=EOUT
*OUTPUT,HISTORY
*NODE OUTPUT,NSET=FIX
RF,
*NODE OUTPUT,NSET=NOUT
U,
*ELEMENT OUTPUT,ELSET=EOUT
S,
E,
*ENERGY OUTPUT,VARIABLE=PRESELECT
*END STEP