*HEADING
 CANTILEVER WITH CONTINUUM ELEMENTS--END SHEAR, CPS4I, 2 X 4 MESH
*NODE
*NGEN,NSET=FIX
*NGEN,NSET=END
*NFILL
FIX,END,4,4
*ELEMENT,TYPE=CPS4I
*ELGEN,ELSET=EALL
*MATERIAL,NAME=A1
*ELASTIC
1.E8,0.
*SOLID SECTION,MATERIAL=A1,ELSET=EALL
.01,
*STEP,PERTURBATION
*STATIC
*BOUNDARY
FIX,1,2
*CLOAD
17,2,-.25
217,2,-.5
417,2,-.25
*EL PRINT
COORD,
S,
E,
*EL PRINT ,POSITION=AVERAGED AT NODES
S,
*NODE FILE
U,
*OUTPUT,FIELD
*NODE OUTPUT
U,
*END STEP