*HEADING
 SKEW-SENSITIVITY ANALYSIS, 30 DEG PARALLELOGRAM, C3D8R, 1 X 8 MESH
*NODE
*NGEN
*NSET,NSET=FIX
*NSET,NSET=N1,GENERATE
*ELEMENT,TYPE=C3D8R
*ELGEN,ELSET=EALL
*MATERIAL,NAME=A1
*ELASTIC
1.E8,0.
*SOLID SECTION,MATERIAL=A1,ELSET=EALL,CONTROLS=HGC
*SECTION CONTROLS,NAME=HGC,HOURGLASS=ENHANCED
*STEP,PERTURBATION
*STATIC
*BOUNDARY
FIX,1,3
N1,3,3
*CLOAD
17,2,-.25
417,2,-.25
1017,2,-.25
1417,2,-.25
*EL PRINT
COORD,
S,
E,
*NODE PRINT
U,
RF,
*OUTPUT,FIELD
*NODE OUTPUT
U,
RF,
*ELEMENT OUTPUT
S,
E,
*NSET,NSET=NOUT
*ELSET,ELSET=EOUT
*OUTPUT,HISTORY
*NODE OUTPUT,NSET=FIX
RF,
*NODE OUTPUT,NSET=NOUT
U,
*ELEMENT OUTPUT,ELSET=EOUT
S,
E,
*ENERGY OUTPUT,VARIABLE=PRESELECT
*END STEP