*HEADING
 CANTILEVER WITH CONTINUUM ELEMENTS--END SHEAR, C3D8R, 4 X 4 MESH
*PREPRINT,ECHO=YES,HISTORY=NO,MODEL=NO
*NODE
*NGEN,NSET=FIX
*NGEN,NSET=END
*NSET,NSET=N1
*NFILL
FIX,END,4,4
*ELEMENT,TYPE=C3D8R
*ELGEN,ELSET=EALL
*MATERIAL,NAME=A1
*ELASTIC
1.E8,0.
*SOLID SECTION,MATERIAL=A1,ELSET=EALL
*STEP,PERTURBATION
*STATIC
*BOUNDARY
FIX,1,3
N1, 3,3
*CLOAD
17,2,-.125
217,2,-.25
417,2,-.125
1017,2,-.125
1217,2,-.25
1417,2,-.125
*NODE FILE,NSET=END
U,
*END STEP