*HEADING
 CANTILEVER WITH CONTINUUM ELEMENTS--END SHEAR, C3D8I, 8 X 16 MESH
*NODE
*NGEN,NSET=FIX1
*NGEN,NSET=FIX2
*NFILL,NSET=FIX
FIX1,FIX2,2,2000
*NGEN,NSET=END1
*NGEN,NSET=END2
*NFILL,NSET=END
END1,END2,2,2000
*NFILL
FIX,END,32,1
*NSET,NSET=N1,GENERATE
*ELEMENT,TYPE=C3D8I
*ELGEN,ELSET=EALL
*MATERIAL,NAME=A1
*ELASTIC
1.E8,0.
*SOLID SECTION,MATERIAL=A1,ELSET=EALL
*STEP,PERTURBATION
*STATIC
*BOUNDARY
FIX,1,3
N1, 2,2
*CLOAD
33,3,-.25
1633,3,-.25
4033,3,-.25
5633,3,-.25
*EL PRINT
COORD,
S,
E,
*NODE FILE
U,
*OUTPUT,FIELD
*NODE OUTPUT
U,
*END STEP