*HEADING
 CANTILEVER WITH CONTINUUM ELEMENTS--END SHEAR, C3D8I, 2 X 4 MESH
*PREPRINT,ECHO=YES,HISTORY=NO,MODEL=NO
*NODE
*NGEN,NSET=FIX
*NGEN,NSET=END
*NFILL
FIX,END,4,4
*NSET, NSET=N1
*ELEMENT,TYPE=C3D8I
*ELGEN,ELSET=EALL
*MATERIAL,NAME=A1
*ELASTIC
1.E8,0.
*SOLID SECTION,MATERIAL=A1,ELSET=EALL
***
*NSET,nset=nout
***
*STEP,PERTURBATION
*STATIC
*BOUNDARY
FIX,1,3
*CLOAD
17,2,-.125
217,2,-.25
417,2,-.125
1017,2,-.125
1217,2,-.25
1417,2,-.125
*NODE FILE,nset=nout
U,
*OUTPUT,FIELD
*NODE OUTPUT
U,
*END STEP