*HEADING
8 X 16 mesh for cantilever bending problem with C3D4 elements.
**
*NODE
*NODE
*NODE
**
**
*ELEMENT, TYPE=C3D4, ELSET=EALL
*SOLID SECTION,ELSET=EALL,MATERIAL=A1
*MATERIAL,NAME=A1
*ELASTIC
1.E8,0.
*STEP, PERTURBATION
Linear Static Analysis
*STATIC
**
** fix
**
*BOUNDARY
       1, 1,,          0.
       1, 2,,          0.
       1, 3,,          0.
      67, 1,,          0.
      67, 2,,          0.
      67, 3,,          0.
     133, 1,,          0.
     133, 2,,          0.
**
** load
**
*CLOAD, OP=NEW
      33, 2,       -0.25
     561, 2,       -0.25
    1027, 2,       -0.25
    1555, 2,       -0.25
*NODE FILE
U,
*OUTPUT,FIELD
*NODE OUTPUT
U,
*EL PRINT
S,
E,
*END STEP