*HEADING
 1 X 4 mesh for cantilever bending problem with C3D4 elements.
**
*NODE
*NODE
*NODE
**
**
*ELEMENT, TYPE=C3D4, ELSET=EALL
*SOLID SECTION,ELSET=EALL,MATERIAL=A1
*MATERIAL,NAME=A1
*ELASTIC
1.E8,0.
**
** step  1,Default
**
*STEP, PERTURBATION
*STATIC
**
** fix
**
*BOUNDARY
       1, 1,,          0.
       1, 2,,          0.
       1, 3,,          0.
      19, 1,,          0.
      19, 2,,          0.
      19, 3,,          0.
      51, 1,,          0.
      51, 2,,          0.
**
** load
**
*CLOAD, OP=NEW
       9, 2,       -0.25
      27, 2,       -0.25
      59, 2,       -0.25
      77, 2,       -0.25
**
*NODE FILE
U,
*OUTPUT,FIELD
*NODE OUTPUT
U,
*EL PRINT
S,
E,
*END STEP