*HEADING
 SKEW-SENSITIVITY ANALYSIS, 0 DEG UNSKEWED, C3D4,
**
*NODE
*NODE
*NODE
**
**
*ELEMENT, TYPE=C3D4, ELSET=EALL
*SOLID SECTION,MATERIAL=A1,ELSET=EALL
*MATERIAL,NAME=A1
*ELASTIC
1.E8,0.
**
** step  1,Default
**
*STEP, PERTURBATION
*STATIC
**
** fix
**
*BOUNDARY
       1, 1,,          0.
       1, 2,,          0.
       1, 3,,          0.
      35, 1,,          0.
      35, 2,,          0.
      35, 3,,          0.
      95, 1,,          0.
      95, 2,,          0.
**
** load
**
*CLOAD, OP=NEW
      17, 2,       -0.25
      51, 2,       -0.25
     111, 2,       -0.25
     145, 2,       -0.25
**
*NODE FILE
U,
*OUTPUT,FIELD
*NODE OUTPUT
U,
*EL PRINT
S,
E,
*END STEP