*HEADING
 SKEW-SENSITIVITY ANALYSIS, 15 DEG PARALLELOGRAM, C3D20R, 1 X 8 MESH
*NODE,NSET=SIDE1
*NODE,NSET=SIDE2
*NGEN,NSET=SIDE1
*NGEN,NSET=SIDE2
*NFILL
SIDE1,SIDE2,2,1000
*NSET,NSET=FIX
*ELEMENT,TYPE=C3D20R
*ELGEN,ELSET=EALL
*MATERIAL,NAME=A1
*ELASTIC
1.E8,0.3
*SOLID SECTION,MATERIAL=A1,ELSET=EALL
*STEP,PERTURBATION
*STATIC
*BOUNDARY
SIDE1,3
FIX,1,3
*CLOAD
17,2,-.25
817,2,-.25
2017,2,-.25
2817,2,-.25
*EL PRINT
COORD,
S,
E,
*NODE FILE
U,
*OUTPUT,FIELD
*NODE OUTPUT
U,
*END STEP