*HEADING
 CANTILEVER WITH CONTINUUM ELEMENTS--END SHEAR, C3D20, 2 X 4 MESH
*NODE
*NGEN,NSET=FIX1
*NGEN,NSET=FIX2
*NFILL,NSET=FIX
FIX1,FIX2,2,1000
*NGEN,NSET=END1
*NGEN,NSET=END2
*NFILL,NSET=END
END1,END2,2,1000
*NFILL
FIX,END,16,1
*NSET,NSET=SIDE1,GENERATE
*ELEMENT,TYPE=C3D20
*ELGEN,ELSET=EALL
*MATERIAL,NAME=A1
*ELASTIC
1.E8,0.
*SOLID SECTION,MATERIAL=A1,ELSET=EALL
*STEP,PERTURBATION
*STATIC
*BOUNDARY
FIX,1,3
SIDE1,2
*CLOAD
17,3,-.25
817,3,-.25
2017,3,-.25
2817,3,-.25
*EL PRINT
COORD,
S,
E,
*NODE FILE
U,
*OUTPUT,FIELD
*NODE OUTPUT
U,
*END STEP