*HEADING
 SKEW-SENSITIVITY ANALYSIS, 45 DEG TRAPEZOID, C3D10M,
**
*NODE
*NODE,NSET=MID
*NODE
*NODE
*NODE,NSET=MID
*NODE
*NODE
*NODE,NSET=MID
*NODE
*NODE
*NODE,NSET=MID
*NODE
*NODE
*NODE,NSET=MID
*NODE
*NODE
*NODE,NSET=MID
*NODE
*NODE
*NODE,NSET=MID
*NODE
*NODE
*NODE,NSET=MID
*NODE
**
**
*ELEMENT, TYPE=C3D10M, ELSET=EALL
*SOLID SECTION,ELSET=EALL,MATERIAL=A1,controls=ctr
*section controls,name=ctr,hourglass=stiffness
*MATERIAL,NAME=A1
*ELASTIC
1.E8,0.
**
** step  1,Default
**
*STEP, PERTURBATION
*STATIC
**
** fix
**
*BOUNDARY
       1, 1,,          0.
       1, 2,,          0.
       1, 3,,          0.
       4, 1,,          0.
       4, 2,,          0.
       4, 3,,          0.
       7, 1,,          0.
       7, 2,,          0.
     MID, 3,,          0.
**
** load
**
*CLOAD, OP=NEW
     183, 2,       -0.25
     189, 2,       -0.25
     200, 2,       -0.25
     206, 2,       -0.25
**
*EL PRINT
S,
E,
*NODE FILE
U,
*OUTPUT,FIELD
*NODE OUTPUT
U,
*END STEP