*HEADING
2 X 4 mesh for cantilever bending problem with C3D10M elements.
**
*NODE
*NODE,NSET=MID
*NODE
**
**
*ELEMENT, TYPE=C3D10M, ELSET=EALL
*SOLID SECTION,ELSET=EALL,MATERIAL=A1,controls=ctr
*section controls,name=ctr,hourglass=stiffness
*MATERIAL,NAME=A1
*ELASTIC
1.E8,0.
**
** step  1,Default
**
*STEP, PERTURBATION
*STATIC
**
** fix
**
*BOUNDARY
       1, 1,,          0.
       1, 2,,          0.
       1, 3,,          0.
      10, 1,,          0.
      10, 2,,          0.
      10, 3,,          0.
      19, 1,,          0.
      19, 2,,          0.
     MID, 3,,          0.
**
** load
**
*CLOAD, OP=NEW
       9, 2,       -0.25
      45, 2,       -0.25
      91, 2,       -0.25
     127, 2,       -0.25
**
*NODE FILE
U,
*OUTPUT,FIELD
*NODE OUTPUT
U,
*EL PRINT
S,
E,
*END STEP