*HEADING
4 X 4 mesh for cantilever bending problems with C3D10 elements.
**
*NODE
*NODE,NSET=MID
*NODE
**
**
*ELEMENT, TYPE=C3D10, ELSET=EALL
**
** step  1,Default
**
*SOLID SECTION,ELSET=EALL,MATERIAL=A1
*MATERIAL,NAME=A1
*ELASTIC
1.E8,0.
*STEP, PERTURBATION
*STATIC
**
** fix
**
*BOUNDARY
       1, 1,,          0.
       1, 2,,          0.
       1, 3,,          0.
      10, 1,,          0.
      10, 2,,          0.
      10, 3,,          0.
      19, 1,,          0.
      19, 2,,          0.
     MID, 3,,          0.
**
** load
**
*CLOAD, OP=NEW
       9, 2,       -0.25
      81, 2,       -0.25
     155, 2,       -0.25
     227, 2,       -0.25
**
*DLOAD, OP=NEW
*TEMPERATURE, OP=NEW
**
*NODE FILE
U,
*OUTPUT,FIELD
*NODE OUTPUT
U,
*EL PRINT
S,
E,
*END STEP