*HEADING
 ELASTIC LARGE DISPLACEMENT TRUSS PROBLEM
*ELEMENT,TYPE=T2D2,ELSET=ALL
*NODE,NSET=NALL
*NSET,NSET=TWO
*SOLID SECTION,MATERIAL=A1,ELSET=ALL
1.,
*MATERIAL,NAME=A1
*ELASTIC
2000.,
*BOUNDARY
1,1,2
2,1
*STEP,NLGEOM,INC=30
*STATIC,DIRECT
.0333333334,1.
*BOUNDARY
2,2,2, -3.
*EL PRINT,SUMMARY=NO
S,E
*EL FILE
S,
*NODE PRINT,SUMMARY=NO
U,RF,CF
*NODE FILE,NSET=TWO
U,RF,CF
*OUTPUT,FIELD,OP=NEW
*ELEMENT OUTPUT
S,
*OUTPUT,HISTORY,OP=NEW
*ELEMENT OUTPUT, Elset=ALL
S,
*OUTPUT,FIELD,OP=NEW
*NODE OUTPUT
U,RF,CF
*OUTPUT,HISTORY,OP=NEW
*NODE OUTPUT,NSET=TWO
U,RF,CF
*END STEP