*HEADING
SINGLE EDGE NOTCH SPECIMEN: LINEAR TEMPERATURE GRADIENT MESH 2
*NODE
*NSET,NSET=RIGHT,GENERATE
*NSET,NSET=YAXIS,GENERATE
*NGEN,NSET=CRACK
*NGEN,NSET=OUTER
*NFILL,SINGULAR=1,NSET=NALL
CRACK,OUTER,12,30
*NGEN,NSET=LOW
*NGEN,NSET=TOP
*NFILL,BIAS=.9,NSET=NALL
LOW,TOP,14,20
*ELEMENT,TYPE=DC2D8
*ELGEN,ELSET=ELS
*NSET,NSET=XAXIS,GENERATE
*SOLID SECTION,ELSET=ELS,MATERIAL=HEAT
*MATERIAL,NAME=HEAT
*SPECIFIC HEAT
.1431,
*DENSITY
.2829,
*CONDUCTIVITY
7.872E-4,
*STEP
*HEAT TRANSFER,STEADY STATE
1.,1.
*BOUNDARY
YAXIS,11,,1000.
RIGHT,11,,-1000.
*NODE FILE
NT,
*OUTPUT,FIELD
*NODE OUTPUT
NT,
*OUTPUT,HISTORY
*NODE OUTPUT, NSET=NALL
NT,
*END STEP