*HEADING
SINGLE EDGE NOTCHED SPECIMEN - LINEAR TEMP. GRADIENT MESH 1
*NODE
*NGEN,NSET=TIP
*NGEN,NSET=NSET1
*NGEN,NSET=NSET2,LINE=C
*NSET,NSET=NSET3
NSET1,NSET2
*NGEN,NSET=TOP
*NFILL,SINGULAR=1,NSET=NALL
TIP,NSET3,32,2
*NFILL,BIAS=.9,NSET=NALL
NSET2,TOP,16,4
*NSET,NSET=X0,GENERATE
*NSET,NSET=CLINE,GENERATE
*NSET,NSET=X2,GENERATE
*ELEMENT,TYPE=DC2D8
*ELGEN,ELSET=REGION1
*ELGEN,ELSET=REGION2
*ELSET,ELSET=ALL
REGION1,REGION2
*ELSET,ELSET=CRACK,GENERATE
*ELSET,ELSET=TOP,GENERATE
*NSET,NSET=INDEP1,GENERATE
*NSET,NSET=INDEP2,GENERATE
*NSET,NSET=INDEP3,GENERATE
*NSET,NSET=DEP1,GENERATE
*NSET,NSET=DEP2,GENERATE
*MPC
QUADRATIC,DEP1,INDEP1,INDEP2,INDEP3
QUADRATIC,DEP2,INDEP1,INDEP2,INDEP3
*SOLID SECTION,MATERIAL=HEAT,ELSET=ALL
*MATERIAL,NAME=HEAT
*SPECIFIC HEAT
.1431,
*DENSITY
.2829,
*CONDUCTIVITY
7.872E-4,
**
** STEP INFORMATION
**
*STEP
*HEAT TRANSFER,STEADY STATE
1.,1.
*BOUNDARY
X0,11,,1000.
X2,11,,-1000.
*NODE FILE
NT,
*OUTPUT,FIELD
*NODE OUTPUT
NT,
*OUTPUT,HISTORY
*NODE OUTPUT, NSET=NALL
NT,
*END STEP