*HEADING
THERMAL LOADING CONTOUR INTEGRAL CALC., MESH 2, 3-D HEAT TRANSFER
*NODE
**
**
*NSET,NSET=RIGHT,GENERATE
*NSET,NSET=YAXIS,GENERATE
*NGEN,NSET=CRFR
*NGEN,NSET=CRMD
*NGEN,NSET=CRBK
*NSET,NSET=CRACK
CRFR,CRMD,CRBK
*NGEN,NSET=OUTER
*NSET,NSET=LOW,GENERATE
*NGEN,NSET=TOP
*NFILL,BIAS=.9
LOW,TOP,14,20
*NFILL,SINGULAR=1
CRACK,OUTER,12,30
*NSET,NSET=FRONT,GENERATE
*NSET,NSET=BACK,GENERATE
*ELEMENT,TYPE=DC3D20
***
*ELGEN,ELSET=ELS
*ELSET,ELSET=PRINT,GENERATE
*NSET,NSET=XAXIS,GENERATE
*SOLID SECTION,ELSET=ELS,MATERIAL=HEAT
*MATERIAL,NAME=HEAT
*SPECIFIC HEAT
.1431,
*DENSITY
.2829,
*CONDUCTIVITY
7.872E-4,
*STEP
*HEAT TRANSFER,STEADY STATE
1.,1.
*BOUNDARY
YAXIS,11,,1000.
RIGHT,11,,-1000.
*NODE PRINT
NT,
*NODE FILE
NT,
*OUTPUT,FIELD
*NODE OUTPUT
NT,
*END STEP