*Heading
** Job name: Hydrofrac-mesh-160 Model name: 160
** Generated by: Abaqus/CAE 6.12-DEV
*Preprint, echo=NO, model=NO, history=NO, contact=NO
**
** PARTS
**
*Part, name=Part-1
*Node
*Element, type=CPE4P
*Nset, nset=_PickedSet32, internal, generate
*Elset, elset=_PickedSet32, internal, generate
** Section: Section-1
*Solid Section, elset=_PickedSet32, material=Material-1
*End Part
**
*Part, name=Part-2
*End Part
**
**
** ASSEMBLY
**
*Assembly, name=Assembly
**
*Instance, name=Part-1-1, part=Part-1
*End Instance
**
*Instance, name=Part-2-1, part=Part-2
*End Instance
**
*Nset, nset=Set-1, instance=Part-1-1
*Elset, elset=Set-1, instance=Part-1-1, generate
*Nset, nset=sym, instance=Part-1-1
*Elset, elset=sym, instance=Part-1-1
*Nset, nset=edge, instance=Part-1-1
*Elset, elset=edge, instance=Part-1-1
*Nset, nset=_PickedSet11, internal, instance=Part-1-1, generate
*Elset, elset=_PickedSet11, internal, instance=Part-1-1, generate
*Nset, nset=_PickedSet12, internal, instance=Part-1-1, generate
*Elset, elset=_PickedSet12, internal, instance=Part-1-1, generate
*Nset, nset=_PickedSet17, internal, instance=Part-1-1, generate
*Elset, elset=_PickedSet17, internal, instance=Part-1-1, generate
*Elset, elset=bc-e1, instance=Part-1-1
*Nset, nset=bc-n1, instance=Part-1-1
*Nset, nset=bc-n2, instance=Part-1-1
*Elset, elset=alle, instance=Part-1-1, generate
*Nset, nset=edge_PP_, internal, instance=Part-1-1
*Enrichment, name=Crack-1, type=PROPAGATION CRACK, elset=_PickedSet17,interaction=lower
*End Assembly
*Amplitude, name=volumerate
             0.,              0.,             63.,           -200.
**
** MATERIALS
**
*Material, name=Material-1
*Damage Initiation, criterion=MAXPS
320.,
*Damage Evolution, type=ENERGY, mixed mode behavior=BK, power=2.284
28.,28.,28.
*Damage Stabilization
*Elastic
 1.294e+06, 0.25
*Fluid Leakoff
*Gap Flow
*Permeability, specific=9.8
 2.418e-08,0.
*surface interaction,name=lower
1,0
*Initial Conditions, type=ENRICHMENT
Part-1-1.644, 1,Crack-1, -0.111111, -0.0625003
Part-1-1.644, 2,Crack-1, -0.111111, 0.
Part-1-1.644, 3,Crack-1, 0.111111, 0.
Part-1-1.644, 4,Crack-1, 0.111111, -0.0625003
Part-1-1.643, 1,Crack-1, -0.111111
Part-1-1.643, 2,Crack-1, -0.111111
Part-1-1.643, 3,Crack-1, 0.111111
Part-1-1.643, 4,Crack-1, 0.111111
Part-1-1.642, 1,Crack-1, -0.111111
Part-1-1.642, 2,Crack-1, -0.111111
Part-1-1.642, 3,Crack-1, 0.111111
Part-1-1.642, 4,Crack-1, 0.111111
Part-1-1.641, 1,Crack-1, -0.111111
Part-1-1.641, 2,Crack-1, -0.111111
Part-1-1.641, 3,Crack-1, 0.111111
Part-1-1.641, 4,Crack-1, 0.111111
**
** BOUNDARY CONDITIONS
**
**
** Name: BC-1 Type: Symmetry/Antisymmetry/Encastre
*Boundary
sym, XSYMM
** Name: BC-2 Type: Displacement/Rotation
*Boundary
edge, 1, 1
edge, 2, 2
*Boundary,phantom=node
Part-1-1.341,1,1
Part-1-1.340,1,1
**
** PREDEFINED FIELDS
**
** Name: Predefined Field-1   Type: Void ratio
*Initial Conditions, TYPE=RATIO
_PickedSet11, 0.333333
** Name: Predefined Field-2   Type: Pore pressure
*Initial Conditions, TYPE=PORE PRESSURE
_PickedSet12, 793.
*INITIAL CONDITIONS, TYPE=STRESS
alle, -12.547e+3, -8.547e+3, -15.00e+3
** ----------------------------------------------------------------
**
** STEP: Step-1
**
*Step, name=Step-1, nlgeom=YES,unsym=yes
*Geostatic
**
** BOUNDARY CONDITIONS
**
** Name: BC-3 Type: Pore pressure
*Boundary
edge_PP_, 8, 8, 793.
**
** OUTPUT REQUESTS
**
*Restart, write, frequency=0
**
** FIELD OUTPUT: F-Output-1
**
*Output, field
*Node Output
PHILSM, POR, U
*Element Output
S
*End Step
** ----------------------------------------------------------------
**
*Step, name=Step-2, nlgeom=YES, inc=1000, unsymm=YES
Injection ~0.02m^3 over 140 second
*Soils, consolidation, end=PERIOD, utol=100000.00
** time in seconds
**
*cflow,amplitude=volumerate,phantom=edge
Part-1-1.341,Part-1-1.340,5e-6
**
** Name: BC-2 Type: Pore pressure
*Boundary
edge_PP_, 8, 8, 793.00e+0
** FIELD OUTPUT: F-Output-1
**
*Output, field,freq=200
*node output
U,
**POR,
PHILSM
*element output
S
**PFOPENXFEM
**LEAKVRTXFEM
**LEAKVRBXFEM
**ALEAKVRTXFEM
**ALEAKVRBXFEM
**PORPRES
**GFVRXFEM
**
*Output, history,freq=100
*element output,elset=bc-e1
**PFOPENXFEM
LEAKVRTXFEM
**LEAKVRBXFEM
**ALEAKVRTXFEM
**ALEAKVRBXFEM
PORPRES
**GFVRXFEM
*End Step