*HEADING
**-------------------------------------------------------------------------------------------------
** ABAQUS input file: holder sizing optimization
**-------------------------------------------------------------------------------------------------
*NODE, NSET=ALL
*ELEMENT, TYPE=S3, ELSET=Property 2: MAT_1 TYPE_1 REAL_2
*ELEMENT, TYPE=S4, ELSET=Property 2: MAT_1 TYPE_1 REAL_2
*ELEMENT, TYPE=S4, ELSET=Property 3: MAT_1 TYPE_1 REAL_3
*ELEMENT, TYPE=MASS, ELSET=MASS_1
*ELSET, ELSET=P1
*ELSET, ELSET=P3
*ELSET, ELSET=DESIGN_ALL
*ELSET, ELSET=DES_RING1
*ELSET, ELSET=DES_RING2
*ELSET, ELSET=DES_RING3
*ELSET, ELSET=DES_HOR1
*ELSET, ELSET=DES_HOR2
*ELSET, ELSET=DES_HOR3
*ELSET, ELSET=DES_HOR4
*ELSET, ELSET=DES_HOR5
*ELSET, ELSET=DES_HOR6
*ELSET, ELSET=DES_HOR7
*ELSET, ELSET=DES_HOR8
*ELSET, ELSET=DES_HOR9
*ELSET, ELSET=DES_HOR10
*ELSET, ELSET=DES_HOR11
*ELSET, ELSET=DES_HOR12
*ELSET, ELSET=DES_VER1
*ELSET, ELSET=DES_VER2
*ELSET, ELSET=DES_VER3
*ELSET, ELSET=DES_VER4
*ELSET, ELSET=DES_VER5
*ELSET, ELSET=DES_VER6
*SHELL SECTION,ELSET=Property 2: MAT_1 TYPE_1 REAL_2,MATERIAL=Material 1
            1.0,
*SHELL SECTION,ELSET=Property 3: MAT_1 TYPE_1 REAL_3,MATERIAL=Material 1
            1.0,
*MASS, ELSET=MASS_1
          0.001,
*MATERIAL,NAME=Material 1
*ELASTIC
  2.06e+05,       0.3
*DENSITY
 7.840e-09,
**--- RBE 2 ---              (EID=3137)
*COUPLING, CONSTRAINT NAME=RBE2_3137, REF NODE=5, SURFACE=RBE2_surface_3137
*KINEMATIC
    1,    6
*SURFACE, NAME=RBE2_surface_3137, TYPE=NODE
**--- RBE 2 ---              (EID=3138)
*COUPLING, CONSTRAINT NAME=RBE2_3138, REF NODE=1, SURFACE=RBE2_surface_3138
*KINEMATIC
    1,    6
*SURFACE, NAME=RBE2_surface_3138, TYPE=NODE
**--- RBE 2 ---              (EID=3139)
*COUPLING, CONSTRAINT NAME=RBE2_3139, REF NODE=2, SURFACE=RBE2_surface_3139
*KINEMATIC
    1,    6
*SURFACE, NAME=RBE2_surface_3139, TYPE=NODE
**--- RBE 2 ---              (EID=3140)
*COUPLING, CONSTRAINT NAME=RBE2_3140, REF NODE=4, SURFACE=RBE2_surface_3140
*KINEMATIC
    1,    6
*SURFACE, NAME=RBE2_surface_3140, TYPE=NODE
**--- RBE 2 ---              (EID=3141)
*COUPLING, CONSTRAINT NAME=RBE2_3141, REF NODE=3, SURFACE=RBE2_surface_3141
*KINEMATIC
    1,    6
*SURFACE, NAME=RBE2_surface_3141, TYPE=NODE
** Medina SPC id 1
*BOUNDARY, TYPE=DISPLACEMENT, OP=NEW
   1,        1,        6,                       0.
   2,        1,        6,                       0.
   3,        1,        6,                       0.
   4,        1,        6,                       0.
**
**
** ---------------------------------------------------
** STEPS
**
** STEP 1, BIEGUNG
**
*STEP, PERTURBATION
*STATIC
**
** CLOAD
**
*CLOAD, OP=NEW
       5,        1,                    -2500.
*OUTPUT, FIELD, FREQUENCY=999
*NODE OUTPUT
U,
*ELEMENT OUTPUT
E,
S,
STH,
*END STEP
**
**
** STEP 2, TORSION
**
*STEP, PERTURBATION
*STATIC
**
** CLOAD
**
*CLOAD, OP=NEW
       5,        4,                     80000.
*OUTPUT, FIELD, FREQUENCY=999
*NODE OUTPUT
U,
*ELEMENT OUTPUT
E,
S,
*END STEP
**