*HEADING
 Substructure generation file for hertzcontact_cpe6m_substr.inp
**
*NODE
**
**
*ELEMENT, TYPE=CPE6M, ELSET=EALL
**
** disp
**
*NSET, NSET=DISP
*EQUATION
DISP,2,1,272,2,-1
*NSET,NSET=CYLSURF
*SOLID SECTION,ELSET=EALL,MATERIAL=A1
1.0,
*MATERIAL,NAME=A1
*ELASTIC
 30.E6,0.3
**
**
*STEP
*SUBSTRUCTURE GENERATE,TYPE=Z1002,OVERWRITE
*RETAINED NODAL DOFS
CYLSURF,
*BOUNDARY
       2, 1,,
       3, 1,,
       4, 1,,
       5, 1,,
       6, 1,,
       7, 1,,
       8, 1,,
       9, 1,,
*END STEP