*HEADING
 Substructure generation file for hertzcontact_c3d10m_substr.inp
**
*NODE
*ELEMENT, TYPE=C3D10M, ELSET=EALL
*NSET, NSET=DISP
*ELSET,ELSET=BOT
*NSET,NSET=CYLSURF
*EQUATION
DISP,2,1,430,2,-1
*SOLID SECTION,MATERIAL=A1, ELSET=EALL
*MATERIAL,NAME=A1
*ELASTIC
 30.E6,0.3
**
**
*STEP
*SUBSTRUCTURE GENERATE,TYPE=Z1003,OVERWRITE
*RETAINED NODAL DOFS
CYLSURF,
*BOUNDARY
     452, 1,,
     453, 1,,
     454, 1,,
     455, 1,,
     456, 1,,
     457, 1,,
     458, 1,,
     459, 1,,
*END STEP