*HEADING
HT PATCH TEST FOR HEAT TRANSFER [CAX6MT]
T=C0+C1x+C2y;C0=0.0,C1=20,C2=10;HFL1=-kC1,HFL2=-kC2
*PREPRINT,ECHO=YES,HISTORY=NO,MODEL=NO
*NODE, NSET=NALL
*NGEN, NSET=NALL
*ELEMENT,TYPE=CAX6MT, ELSET=EALL
*ELSET,ELSET=EOUT
*ELSET,ELSET=QA_TEST
EOUT
**
*SOLID SECTION,MATERIAL=A1, ELSET=EALL
*MATERIAL,NAME=A1
*ELASTIC
1.0,0.0
*CONDUCTIVITY
4.85E-4,
*DENSITY
0.283,
*SPECIFIC HEAT
0.116,
*EXPANSION
0.0,
*STEP
 RUN TO STEADY STATE
*DYNAMIC TEMPERATURE-DISPLACEMENT, EXPLICIT
*BOUNDARY
10,11, ,  0.0
20,11, , 48.0
30,11, , 60.0
40,11, , 12.0
50,11, , 24.0
60,11, , 54.0
70,11, , 36.0
80,11, ,  6.0
******************************
*FILE OUTPUT, NUM=1
*EL FILE,ELSET=EOUT
TEMP,HFL,
******************************
*OUTPUT,FIELD,NUM=1
*ELEMENT OUTPUT, ELSET=QA_TEST
TEMP,HFL,
*NODE OUTPUT, NSET=NALL
NT,
******************************
*OUTPUT, HISTORY,TIME INTERVAL=2
*NODE OUTPUT, NSET=NALL
NT,
*************
*OUTPUT, HISTORY,TIME INTERVAL=20
*ENERGY OUTPUT,VAR=ALL
******************************
*ENDSTEP