*HEADING
HT PATCH TEST FOR COUPLED TMEPERATURE_DISPLACEMENT ELEMENTS  [C3D6T]
T=C0+C1x+C2y+C3z;C0=0.0,C1=200,C2=100,C3=200;HFL1=-kC1,HFL2=-kC2,HFL3=-kC3
*PREPRINT,ECHO=YES,HISTORY=NO,MODEL=NO
*NODE,NSET=NALL
*****
*ELEMENT,TYPE=C3D6T, ELSET=EALL
*ELSET,ELSET=EOUT
*ELSET,ELSET=QA_TEST
EOUT
*****
*SOLID SECTION,MATERIAL=A1, ELSET=EALL
*MATERIAL,NAME=A1
*ELASTIC
1.0,0.0
*CONDUCTIVITY
4.85E-4
*DENSITY
0.283
*SPECIFIC HEAT
0.116
*EXPANSION
0.0
*INITIAL CONDITIONS,TYPE=TEMP
NALL,0.0
*STEP
 RUN TO STEADY STATE
*DYNAMIC TEMPERATURE-DISPLACEMENT, EXPLICIT
*BOUNDARY
10,11, , 200.
30,11, , 400.
70,11, ,  0.
90,11, , 200.
210,11, , 300.
230,11, , 500.
270,11, , 100.
290,11, , 300.
******************************
*FILE OUTPUT, NUM=1
*EL FILE,ELSET=EOUT
 TEMP,HFL,
******************************
*OUTPUT,FIELD,NUM=1
*ELEMENT OUTPUT, ELSET=QA_TEST
TEMP,HFL,
*NODE OUTPUT, NSET=NALL
NT,
******************************
***OUTPUT, HISTORY,TIME INTERVAL=2
***NODE OUTPUT, NSET=NALL
**NT,
*********
*OUTPUT, HISTORY,TIME INTERVAL=20
*ENERGY OUTPUT,VAR=ALL
******************************
*ENDSTEP