*HEADING
HT PATCH TEST FOR COUPLED TEMPERATURE-DISPLACEMENT ELEMENTS  [C3D4T]
T=C0+C1x+C2y+C3z;C0=0.0,C1=200,C2=100,C3=200;HFL1=-kC1,HFL2=-kC2,HFL3=-kC3
*PREPRINT,ECHO=YES,HISTORY=NO,MODEL=NO
*NODE,NSET=OUT
*NODE,NSET=IN
*NSET,NSET=NALL
OUT,IN
*ELEMENT,TYPE=C3D4T,ELSET=E1
*ELSET,ELSET=EOUT
*ELSET,ELSET=QA_TEST
EOUT,
*SOLID SECTION,MATERIAL=A1, ELSET=E1
*MATERIAL,NAME=A1
*ELASTIC
1.0,0.0
*CONDUCTIVITY
4.85E-4,
*DENSITY
0.283,
*SPECIFIC HEAT
0.116,
*EXPANSION
0.0,
*INITIAL CONDITION,TYPE=TEMP
OUT,0.0
IN,0.0
*STEP
 STEADY STATE
*DYNAMIC TEMPERATURE-DISPLACEMENT, EXPLICIT
*BOUNDARY
 10,11, , 200.
 30,11, , 400.
 70,11, ,  00.0
 90,11, , 200.
210,11, , 300.
230,11, , 500.
270,11, , 100.
290,11, , 300.
******************************
*FILE OUTPUT, NUM=1
*EL FILE,ELSET=EOUT
 TEMP,HFL,
******************************
*OUTPUT,FIELD,NUM=1
*ELEMENT OUTPUT, ELSET=QA_TEST
TEMP,HFL,
*NODE OUTPUT, NSET=NALL
NT,
******************************
***OUTPUT, HISTORY,TIME INTERVAL=2
***NODE OUTPUT, NSET=NALL
**NT,
****
*OUTPUT, HISTORY,TIME INTERVAL=20
*ENERGY OUTPUT,VAR=ALL
******************************
*ENDSTEP