*HEADING
HT PATCH TEST FOR HEAT TRANSFER [C3D10MT]
*PREPRINT,ECHO=YES,HISTORY=NO,MODEL=NO
*NODE, NSET=NALL
*NODE
*NGEN,NSET=OUT
*NGEN
*ELEMENT,TYPE=C3D10MT, ELSET=EALL
*ELSET,ELSET=EOUT
*ELSET,ELSET=QA_TEST
EOUT
**
*SOLID SECTION,MATERIAL=A1, ELSET=EALL
*MATERIAL,NAME=A1
*ELASTIC
1.0,0.0
*CONDUCTIVITY
4.85E-4,
*DENSITY
0.283,
*SPECIFIC HEAT
0.116,
*EXPANSION
0.0,
*STEP
 RUN TO STEADY STATE
*DYNAMIC TEMPERATURE-DISPLACEMENT, EXPLICIT
*BOUNDARY
 10,11, ,200.
 30,11, ,400.
 70,11, ,000.
 90,11, ,200.
210,11, ,300.
230,11, ,500.
270,11, ,100.
290,11, ,300.
******************************
*FILE OUTPUT, NUM=1
*EL FILE,ELSET=EOUT
 TEMP,HFL,
******************************
*OUTPUT,FIELD,NUM=1
*ELEMENT OUTPUT, ELSET=QA_TEST
TEMP,HFL,
*NODE OUTPUT, NSET=NALL
NT,
******************************
***OUTPUT, HISTORY,TIME INTERVAL=2
***NODE OUTPUT, NSET=NALL
**NT,
**********
*OUTPUT, HISTORY,TIME INTERVAL=20
*ENERGY OUTPUT,VAR=ALL
******************************
*ENDSTEP