*HEADING
**  Test thermal contact with analytical rigid surface
**
*NODE
*ELEMENT, TYPE=C3D8RT, ELSET=SOLID
*SURFACE, TYPE=CYLINDER, NAME=RIGIDSURFACE
START,         -0.7,          0.2
 LINE,         -0.9,          0.2
*SURFACE, TYPE=ELEMENT, NAME=SOLID
SOLID, S2
*NSET,NSET=REF
*RIGID BODY, REF NODE=REF, ANALYTICAL SURFACE=RIGIDSURFACE, ISOTHERMAL=YES
*MATERIAL, NAME=MATERIAL-1
*CONDUCTIVITY
1.,
*DENSITY
2500.,
*ELASTIC
 3E+06, 0.3
*SPECIFIC HEAT
100.,
*EXPANSION
0.,
*SOLID SECTION, ELSET=SOLID, MATERIAL=MATERIAL-1
*BOUNDARY
24, 1, 3
16, 1, 2
13, 2, 2
21, 2, 2
REF, 2, 6
*SURFACE INTERACTION, NAME=INTPROP-1
*GAP CONDUCTANCE
*STEP
*DYNAMIC TEMPERATURE-DISPLACEMENT, EXPLICIT
*BOUNDARY, TYPE=VELOCITY
REF, 1, 1, 2.
*BOUNDARY
REF, 11, 11, 100.
*CONTACT
*CONTACT INCLUSION, ALL EXTERIOR
*CONTACT PROPERTY ASSIGNMENT
SOLID,RIGIDSURFACE,INTPROP-1
*NSET,NSET=QA_TESTN,GEN
*OUTPUT, FIELD, NUM=1
*NODE OUTPUT, NSET=QA_TESTN
U, NT
*OUTPUT, FIELD, NUM=10
*NODE OUTPUT
U, NT
*CONTACT OUTPUT
HFL,HTL,CSTRESS
*END STEP