*HEADING
BASIC VERIFICATION OF FIELD DEPENDENCE OF CONDUCTIVITY
TEST TYPE: MATERIAL VERIFICATION  [CPE4RT]
**
** See "Thermal properties"  of ABAQUS/Verification
** Manual -- Chapter 2.3.1
**
*NODE,NSET=NALL
*NSET,NSET=FVNODS
*NSET,NSET=QA_TEST
FVNODS
*ELEMENT,ELSET=K1K3,TYPE=CPE4RT
*ELEMENT,ELSET=K2FV,TYPE=CPE4RT
*SOLID SECTION,ELSET=K1K3,MATERIAL=KCONST
3.,
*SOLID SECTION,ELSET=K2FV,MATERIAL=KFVDEP
3.,
*INITIAL CONDITIONS,TYPE=TEMPERATURE
NALL,0.
*INITIAL CONDITIONS,TYPE=FIELD
NALL,0.
*MATERIAL,NAME=KCONST
*ELASTIC
1.0,0.0
*EXPANSION
0.0,
*CONDUCTIVITY
150.,
*DENSITY
7850.,
*SPECIFIC HEAT
460.,
*MATERIAL,NAME=KFVDEP
*ELASTIC
1.0,0.0
*EXPANSION
0.0,
*CONDUCTIVITY,DEP=1
1.,,25.
10.,,50.
100.,,75.
1000,,100.
*DENSITY
7850.,
*SPECIFIC HEAT
460.,
*AMPLITUDE,NAME=RISE
0.,0.,1.e6,1.
*STEP
*DYNAMIC TEMPERATURE-DISPLACEMENT, EXPLICIT
*BOUNDARY
1, 11,,1000.
4, 11,,0.
11,11,,1000.
14,11,,0.
*FIELD,VARIABLE=1,AMP=RISE
FVNODS,100.
*********************************
*FILE OUTPUT, NUM=4, TIMEMARKS=YES
*NODE FILE, NSET=FVNODS
NT, U
*********************************
*OUTPUT, FIELD, NUM=4
*NODE OUTPUT, NSET=QA_TEST
NT,
*****
*NODE OUTPUT, NSET=NALL
NT,
*********************************
***OUTPUT, HISTORY, FREQUENCY=500
***NODE OUTPUT, NSET=FVNODS
**NT,
*********
*OUTPUT, HISTORY, TIME INTERVAL=0.35E6
*ENERGY OUTPUT,VAR=ALL
**********************************
*END STEP