*Heading
** Job name: fml_c3d8r_deg15_vis1_std Model name: BluntNotch
*Preprint, echo=NO, model=NO, history=NO, contact=NO
**
** PARTS
**
*Part, name=Part-1
*End Part
**
*Part, name=Part-2
*End Part
**
**
** ASSEMBLY
**
*Assembly, name=Assembly
**
*Instance, name=Part-1-1, part=Part-1
*Node
*Element, type=COH3D8
*Element, type=C3D8R
*Element, type=C3D8I
*Nset, nset=aluminum_ext
*Elset, elset=aluminum_ext
*Nset, nset=cohesive_ext
*Elset, elset=cohesive_ext
*Nset, nset=composite_ext
*Elset, elset=composite_ext
*Nset, nset=cohesive_middle
*Elset, elset=cohesive_middle
*Nset, nset=composite_int
*Elset, elset=composite_int
*Nset, nset=cohesive_int
*Elset, elset=cohesive_int
*Nset, nset=aluminum_int
*Elset, elset=aluminum_int
** Region: (cohesive_sec_ext:cohesive_ext), (Controls:Default)
** Section: cohesive_sec_ext
*Cohesive Section, elset=cohesive_ext, material=cohesive, response=TRACTION SEPARATION, thickness=SPECIFIED
1.,
*Orientation, name=Ori-1
** Region: (composite_sec_ext:composite_ext), (Controls:EC-1), (Material Orientation:composite_ext)
** Section: composite_sec_ext
*Solid Section, elset=composite_ext, orientation=Ori-1, controls=EC-1, material=composite
0.125,
** Region: (cohesive_sec_middle:cohesive_middle), (Controls:Default)
** Section: cohesive_sec_middle
*Cohesive Section, elset=cohesive_middle, material=cohesive, response=TRACTION SEPARATION, thickness=SPECIFIED
1.,
*Orientation, name=Ori-2
** Region: (composite_sec_int:composite_int), (Controls:EC-1), (Material Orientation:composite_int)
** Section: composite_sec_int
*Solid Section, elset=composite_int, orientation=Ori-2, controls=EC-1, material=composite
0.125,
** Region: (cohesive_sec_int:cohesive_int), (Controls:Default)
** Section: cohesive_sec_int
*Cohesive Section, elset=cohesive_int, material=cohesive, response=TRACTION SEPARATION, thickness=SPECIFIED
1.,
** Region: (aluminum_sec_int:aluminum_int), (Controls:Default)
** Section: aluminum_sec_int
*Solid Section, elset=aluminum_int, material=aluminum
0.15,
** Region: (aluminum_sec_ext:aluminum_ext), (Controls:Default)
** Section: aluminum_sec_ext
*Solid Section, elset=aluminum_ext, material=aluminum
0.3,
*End Instance
**
*Instance, name=Part-2-1, part=Part-2
*Node
*Nset, nset=Part-2-1-RefPt_, internal
*End Instance
**
*Nset, nset=x-symm, instance=Part-1-1
*Elset, elset=x-symm, instance=Part-1-1
*Nset, nset=y-symm, instance=Part-1-1
*Elset, elset=y-symm, instance=Part-1-1
*Nset, nset=z-symm, instance=Part-1-1
*Elset, elset=z-symm, instance=Part-1-1
*Nset, nset=x-load, instance=Part-1-1
*Elset, elset=x-load, instance=Part-1-1
*Nset, nset=x-ref, instance=Part-2-1
*Nset, nset=QA_TEST_RF, instance=Part-2-1
*Nset, nset=aluminum_ext, instance=Part-1-1
*Elset, elset=aluminum_ext, instance=Part-1-1
*Nset, nset=cohesive_ext, instance=Part-1-1
*Elset, elset=cohesive_ext, instance=Part-1-1
*Nset, nset=composite_ext, instance=Part-1-1
*Elset, elset=composite_ext, instance=Part-1-1
*Nset, nset=cohesive_middle, instance=Part-1-1
*Elset, elset=cohesive_middle, instance=Part-1-1
*Nset, nset=composite_int, instance=Part-1-1
*Elset, elset=composite_int, instance=Part-1-1
*Nset, nset=cohesive_int, instance=Part-1-1
*Elset, elset=cohesive_int, instance=Part-1-1
*Nset, nset=aluminum_int, instance=Part-1-1
*Elset, elset=aluminum_int, instance=Part-1-1
** Constraint: Constraint-1
*Equation
x-load, 1, 1.
x-ref, 1, -1.
*End Assembly
**
** ELEMENT CONTROLS
**
*Section Controls, name=EC-1, hourglass=ENHANCED
*Amplitude, name=disp-amp, time=TOTAL TIME
0., 0., 1., 1.
**
** MATERIALS
**
*Material, name=aluminum
*Elastic
73800., 0.33
*Plastic
300.,      0.
320., 0.00016
340., 0.00047
355., 0.00119
375., 0.00449
390., 0.01036
410.,  0.0213
430., 0.03439
*Material, name=cohesive
*Elastic,type=traction
2000e3,751.8796992e3,751.8796992e3
*damage initiation,criterion=quade
2.5e-5,6.65e-5,6.65e-5
*damage evolution,type=energy,mixed mode behavior=power,softening=exponential,mode mix ratio=energy,power=2
4,4,4
*Material, name=composite
*Depvar
*User Material, constants=14, unsymm
**
** BOUNDARY CONDITIONS
**
** Name: bc-xsymm Type: Symmetry/Antisymmetry/Encastre
*Boundary
x-symm, XSYMM
** Name: bc-ysymm Type: Symmetry/Antisymmetry/Encastre
*Boundary
y-symm, YSYMM
** Name: bc-zsymm Type: Symmetry/Antisymmetry/Encastre
*Boundary
z-symm, ZSYMM
** ----------------------------------------------------------------
**
** STEP: Step-1
**
*Step, name=Step-1, nlgeom=YES, inc=1000, unsymm=YES
uniaxial loading
*Static
0.01, 0.273, 2.73e-06, 0.01
**
** BOUNDARY CONDITIONS
**
** Name: xload Type: Displacement/Rotation
*Boundary, amplitude=disp-amp
x-ref, 1, 1, 10.
**
** OUTPUT REQUESTS
**
*Restart, write, frequency=0
**
** FIELD OUTPUT: F-Output-1
**
*Output, field
*Node Output
RF, U
*Element Output, directions=YES
LE, S
**
** FIELD OUTPUT: F-Output-2
**
*Element Output, elset=aluminum_ext, directions=YES
PE, PEEQ
**
** FIELD OUTPUT: F-Output-3
**
*Element Output, elset=aluminum_int, directions=YES
PE, PEEQ
**
** FIELD OUTPUT: F-Output-4
**
*Element Output, elset=cohesive_ext, directions=YES
NE, SDEG
**
** FIELD OUTPUT: F-Output-5
**
*Element Output, elset=cohesive_int, directions=YES
NE, SDEG
**
** FIELD OUTPUT: F-Output-6
**
*Element Output, elset=cohesive_middle, directions=YES
NE, SDEG
**
** FIELD OUTPUT: F-Output-7
**
*Element Output, elset=composite_ext, directions=YES
SDV, STH
**
** FIELD OUTPUT: F-Output-8
**
*Element Output, elset=composite_int, directions=YES
SDV, STH
**
** HISTORY OUTPUT: H-Output-2
**
*Output, history
*Node Output, nset=x-ref
RF1, U1
**
** HISTORY OUTPUT: H-Output-3
**
*Output, history, frequency=10
*Node Output, nset=QA_TEST_RF
RF1,
**
** HISTORY OUTPUT: H-Output-1
**
*Output, history, variable=PRESELECT, frequency=10
*End Step