*Heading
** Job name: fastener_unsort_s4 Model name: Model-1
*preprint, model=yes, history=yes
**
** PARTS
**
*Part, name=Part-2
*End Part
**
** ASSEMBLY
**
*Assembly, name=Assembly
**
*Instance, name=Part-2-1, part=Part-2
*Node
*Element, type=S4
** Region: (Section-1:Picked)
*Elset, elset=_I1, internal, generate
** Section: Section-1
*Shell Section, elset=_I1, material=Material-1
0.02, 5
*End Instance
**
*Instance, name=Part-2-2, part=Part-2
*Node
*Element, type=S4
** Region: (Section-1:Picked)
*Elset, elset=_I1, internal, generate
** Section: Section-1
*Shell Section, elset=_I1, material=Material-1
0.02, 5
*End Instance
**
*Instance, name=Part-2-3, part=Part-2
*Node
*Element, type=S4
** Region: (Section-1:Picked)
*Elset, elset=_I1, internal, generate
** Section: Section-1
*Shell Section, elset=_I1, material=Material-1
0.02, 5
*End Instance
**
*Instance, name=Part-2-4, part=Part-2
*Node
*Element, type=S4
** Region: (Section-1:Picked)
*Elset, elset=_I1, internal, generate
** Section: Section-1
*Shell Section, elset=_I1, material=Material-1
0.02, 5
*End Instance
**
*Instance, name=Part-2-5, part=Part-2
*Node
*Element, type=S4
** Region: (Section-1:Picked)
*Elset, elset=_I1, internal, generate
** Section: Section-1
*Shell Section, elset=_I1, material=Material-1
0.02, 5
*End Instance
*Nset, nset=refNode1, internal, instance=Part-2-1
*Nset, nset=refNode2, internal, instance=Part-2-2
*Nset, nset=refNode3, internal, instance=Part-2-3
*Nset, nset=refNode4, internal, instance=Part-2-4
*Nset, nset=refNode5, internal, instance=Part-2-5
*Nset, nset=refNode
 refNode1, refNode2, refNode3, refNode4, refNode5
*Nset, nset=_PickedSet35, internal, instance=Part-2-1, generate
*Nset, nset=_PickedSet35, internal, instance=Part-2-2, generate
*Nset, nset=_PickedSet35, internal, instance=Part-2-3, generate
*Nset, nset=_PickedSet35, internal, instance=Part-2-4, generate
*Nset, nset=_PickedSet35, internal, instance=Part-2-5, generate
*Elset, elset=_TopSurf_SPOS, internal, instance=Part-2-1, generate
*Elset, elset=_TopSurf_SPOS, internal, instance=Part-2-2, generate
*Elset, elset=_TopSurf_SPOS, internal, instance=Part-2-3, generate
*Elset, elset=_TopSurf_SPOS, internal, instance=Part-2-5, generate
*Elset, elset=_TopSurf_SPOS, internal, instance=Part-2-4, generate
*Surface, type=ELEMENT, name=TopSurf
_TopSurf_SPOS, SPOS
*Elset, elset=_TopSurf1_SPOS, internal, instance=Part-2-1, generate
*Surface, type=ELEMENT, name=TopSurf1
_TopSurf1_SPOS, SPOS
*Elset, elset=_TopSurf2_SPOS, internal, instance=Part-2-2, generate
*Surface, type=ELEMENT, name=TopSurf2
_TopSurf2_SPOS, SPOS
*Elset, elset=_TopSurf3_SPOS, internal, instance=Part-2-3, generate
*Surface, type=ELEMENT, name=TopSurf3
_TopSurf3_SPOS, SPOS
*Elset, elset=_TopSurf4_SPOS, internal, instance=Part-2-4, generate
*Surface, type=ELEMENT, name=TopSurf4
_TopSurf4_SPOS, SPOS
*Elset, elset=_TopSurf5_SPOS, internal, instance=Part-2-5, generate
*Surface, type=ELEMENT, name=TopSurf5
_TopSurf5_SPOS, SPOS
*Elset, elset=_TopSurf11_SPOS, internal, instance=Part-2-1, generate
*Surface, type=ELEMENT, name=TopSurf11
_TopSurf11_SPOS, SPOS
*Elset, elset=_TopSurf12_SPOS, internal, instance=Part-2-1, generate
*Surface, type=ELEMENT, name=TopSurf12
_TopSurf12_SPOS, SPOS
*Elset, elset=_TopSurf13_SPOS, internal, instance=Part-2-1, generate
*Surface, type=ELEMENT, name=TopSurf13
_TopSurf13_SPOS, SPOS
*Elset, elset=_TopSurf14_SPOS, internal, instance=Part-2-1, generate
*Surface, type=ELEMENT, name=TopSurf14
_TopSurf14_SPOS, SPOS
*Elset, elset=_TopSurf15_SPOS, internal, instance=Part-2-1, generate
*Surface, type=ELEMENT, name=TopSurf15
_TopSurf15_SPOS, SPOS
*Elset, elset=_TopSurf21_SPOS, internal, instance=Part-2-2, generate
*Surface, type=ELEMENT, name=TopSurf21
_TopSurf21_SPOS, SPOS
*Elset, elset=_TopSurf22_SPOS, internal, instance=Part-2-2, generate
*Surface, type=ELEMENT, name=TopSurf22
_TopSurf22_SPOS, SPOS
*Elset, elset=_TopSurf23_SPOS, internal, instance=Part-2-2, generate
*Surface, type=ELEMENT, name=TopSurf23
_TopSurf23_SPOS, SPOS
*Elset, elset=_TopSurf24_SPOS, internal, instance=Part-2-2, generate
*Surface, type=ELEMENT, name=TopSurf24
_TopSurf24_SPOS, SPOS
*Elset, elset=_TopSurf25_SPOS, internal, instance=Part-2-2, generate
*Surface, type=ELEMENT, name=TopSurf25
_TopSurf25_SPOS, SPOS
*Elset, elset=_TopSurf31_SPOS, internal, instance=Part-2-3, generate
*Surface, type=ELEMENT, name=TopSurf31
_TopSurf31_SPOS, SPOS
*Elset, elset=_TopSurf32_SPOS, internal, instance=Part-2-3, generate
*Surface, type=ELEMENT, name=TopSurf32
_TopSurf32_SPOS, SPOS
*Elset, elset=_TopSurf33_SPOS, internal, instance=Part-2-3, generate
*Surface, type=ELEMENT, name=TopSurf33
_TopSurf33_SPOS, SPOS
*Elset, elset=_TopSurf34_SPOS, internal, instance=Part-2-3, generate
*Surface, type=ELEMENT, name=TopSurf34
_TopSurf34_SPOS, SPOS
*Elset, elset=_TopSurf35_SPOS, internal, instance=Part-2-3, generate
*Surface, type=ELEMENT, name=TopSurf35
_TopSurf35_SPOS, SPOS
** ... 30 like lines cut
*End Assembly
*Fastener, interaction name=inter-1, property=prop-1, reference node set=refNode1
 TopSurf11,TopSurf12,TopSurf13,TopSurf14,TopSurf15
*Fastener, interaction name=inter-2, property=prop-1, reference node set=refNode2, weighting method=uniform
 TopSurf25,TopSurf24,TopSurf23,TopSurf22,TopSurf21
*Fastener, interaction name=inter-3, property=prop-1, reference node set=refNode3, unsorted, weighting method=linear
 TopSurf35,TopSurf34,TopSurf33,TopSurf32,TopSurf31
*Fastener, interaction name=inter-4, property=prop-1, reference node set=refNode4, weighting method=quadratic
 TopSurf41,TopSurf45,TopSurf42,TopSurf43,TopSurf44
*Fastener, interaction name=inter-5, property=prop-1, reference node set=refNode5, unsorted, weighting method=cubic
 TopSurf51,TopSurf55,TopSurf52,TopSurf53,TopSurf54
*Fastener Property, name=prop-1
**
** MATERIALS
**
*Material, name=Material-1
*Elastic
 2e+11, 0.3
** ----------------------------------------------------------------
**
** STEP: Step-1
**
*Step, name=Step-1
Load
*Static
 0.25, 1.
**
** BOUNDARY CONDITIONS
**
** Name: BC-1 Type: Displacement/Rotation
*Boundary
_PickedSet35, 1, 3
**
** LOADS
**
** Name: Load-1   Type: Pressure
*Dsload
TopSurf, P, -1.e3
**
** FIELD OUTPUT: F-Output-1
**
*Output, field
*Node Output
 U,
*End Step