*HEADING
 CANTILEVER WITH SHELL ELEMENTS--END SHEAR, S4R, 2 X 4 MESH
 EXPLICIT ANALYSIS WITH ENHANCED HOURGLASS CONTROL
*NODE
*NGEN,NSET=FIX
*NGEN,NSET=END
*NFILL,NSET=MIDDLE
FIX,END,4,4
*NSET,NSET=QA_TEST_ALLNODES
FIX,END,MIDDLE
*ELEMENT,TYPE=S4R
*ELGEN,ELSET=EALL
*MATERIAL,NAME=A1
*ELASTIC
1.E8,0.
*DENSITY
0.25
*SHELL SECTION,MATERIAL=A1,ELSET=EALL,CONTROLS=HGLASS
.01,
*SECTION CONTROLS,NAME=HGLASS,HOURGLASS=ENHANCED
*AMPLITUDE,NAME=LOAD,DEFINITION=SMOOTH STEP
0.0,0.0,0.1,1.0
*STEP
*DYNAMIC,EXPLICIT
,0.2
*BULK VISCOSITY
*BOUNDARY
FIX,1,6
MIDDLE,3,5
END,3,5
*CLOAD,AMPLITUDE=LOAD
17,2,-.25
217,2,-.5
417,2,-.25
*OUTPUT,FIELD,NUMBER INTERVAL=3
*ELEMENT OUTPUT
S,E
*NODE OUTPUT
U,
*OUTPUT,HISTORY,TIME INTERVAL=2e-3
*NODE OUTPUT, NSET=FIX
RF2
*NODE OUTPUT,NSET=END
U2
*ENERGY OUTPUT
ALLAE,ALLCD,ALLKE,ALLIE,ALLWK,ETOTAL,ALLSE
**********************************
** OUTPUT FOR ABAQUS QA PURPOSES
**********************************
*OUTPUT, FIELD, NUMBER INTERVAL=4, TIMEMARKS=YES
*NODE OUTPUT, NSET=QA_TEST_ALLNODES
U,
*FILE OUTPUT,NUMBER INTERVAL=4, TIMEMARKS=YES
*NODE FILE,NSET=QA_TEST_ALLNODES
U
*END STEP